case $MAKEFLAGS in \
*-s*)  CC='gcc' LDSHARED='gcc -shared -Wl,--enable-auto-image-base' OPT='-DNDEBUG -g -fwrapv -O3 -Wall -Wstrict-prototypes' ./python.exe -E ./setup.py -q build;; \
*)  CC='gcc' LDSHARED='gcc -shared -Wl,--enable-auto-image-base' OPT='-DNDEBUG -g -fwrapv -O3 -Wall -Wstrict-prototypes' ./python.exe -E ./setup.py build;; \
esac
running build
running build_ext
/usr/include/sqlite3.h: version 3.5.9
INFO: Can't locate Tcl/Tk libs and/or headers
running build_scripts
find ./Lib -name '*.py[co]' -print | xargs rm -f
./python.exe -E -tt ./Lib/test/regrtest.py -l 
test_grammar
test_opcodes
test_operations
test_builtin
test test_builtin failed -- Traceback (most recent call last):
  File "C:\msys\src\python2.5-2.5.2\lib\test\test_builtin.py", line 1312, in test_open
    self.assertEqual(fp.readline(4), '1+1\n')
AssertionError: '1+1\r' != '1+1\n'

test_exceptions
test_types
test_unittest
test_doctest
test_doctest2
test_MimeWriter
test_StringIO
test___all__
test___future__
test__locale
test__locale skipped -- cannot import name RADIXCHAR
test_aepack
test_aepack skipped -- No module named aepack
test_al
test_al skipped -- No module named al
test_anydbm
test_applesingle
test_applesingle skipped -- No module named macostools
test_array
test_ast
test_asynchat
test_atexit
test_audioop
test_augassign
test_base64
test_bastion
test_bigaddrspace
test_bigmem
test_binascii
test_binhex
test_binop
test_bisect
test_bool
test_bsddb
test_bsddb skipped -- No module named _bsddb
test_bsddb185
test_bsddb185 skipped -- No module named bsddb185
test_bsddb3
test_bsddb3 skipped -- Use of the `bsddb' resource not enabled
test_bufio
test_bz2
test_bz2 skipped -- No module named bz2
test_cProfile
test_cProfile skipped -- No module named pstats
test_calendar
test_call
test_capi
test_cd
test_cd skipped -- No module named cd
test_cfgparser
test_cgi
test_charmapcodec
test_cl
test_cl skipped -- No module named cl
test_class
test_cmath
test_cmd_line
test_code
test_codeccallbacks
test_codecencodings_cn
test_codecencodings_hk
test_codecencodings_jp
test_codecencodings_kr
test_codecencodings_tw
test_codecmaps_cn
test_codecmaps_cn skipped -- Use of the `urlfetch' resource not enabled
test_codecmaps_hk
test_codecmaps_hk skipped -- Use of the `urlfetch' resource not enabled
test_codecmaps_jp
test_codecmaps_jp skipped -- Use of the `urlfetch' resource not enabled
test_codecmaps_kr
test_codecmaps_kr skipped -- Use of the `urlfetch' resource not enabled
test_codecmaps_tw
test_codecmaps_tw skipped -- Use of the `urlfetch' resource not enabled
test_codecs
test_codeop
test_coding
test_coercion
test_colorsys
test_commands
test_commands skipped -- Not posix; skipping test_commands
test_compare
test_compile
test_compiler
test_complex
test_complex_args
test_contains
test_contextlib
test_cookie
test_cookielib
test_copy
test_copy_reg
test_cpickle
test test_cpickle failed -- errors occurred; run in verbose mode for details
test_crypt
test_crypt skipped -- No module named crypt
test_csv
test_ctypes
test_curses
test_curses skipped -- No module named _curses
test_datetime
test_dbm
test_dbm skipped -- No module named dbm
test_decimal
test_decorators
test_defaultdict
test_deque
test_descr
test_descrtut
test_dict
test_difflib
test_dircache
test_dis
test_distutils
test_dl
test_dl skipped -- No module named dl
test_dumbdbm
test_dummy_thread
test_dummy_threading
test_email
test_email_codecs
test_email_renamed
test_enumerate
test_eof
test_errno
test_exception_variations
test_extcall
test_fcntl
test_fcntl skipped -- No module named fcntl
test_file
test test_file failed -- Traceback (most recent call last):
  File "C:\msys\src\python2.5-2.5.2\lib\test\test_file.py", line 323, in testIteration
    os.unlink(TESTFN)
WindowsError: [Error 32] Sharing violation: '@test'

test_filecmp
test_fileinput
test_float
test_fnmatch
test_fork1
test_fork1 skipped -- os.fork not defined -- skipping test_fork1
test_format
test_fpformat
test_frozen
test_funcattrs
test_functools
test_future
test_gc
test_gdbm
test_gdbm skipped -- No module named gdbm
test_generators
test_genexps
test_getargs
test_getargs2
test_getopt
test_gettext
test_gl
test_gl skipped -- No module named gl
test_glob
test_global
test_grp
test_grp skipped -- No module named grp
test_gzip
test test_gzip failed -- Traceback (most recent call last):
  File "C:\msys\src\python2.5-2.5.2\lib\test\test_gzip.py", line 59, in test_append
    self.assertEqual(d, (data1*50) + (data2*15))
AssertionError: '  int length=DEFAULTALLOC, err = Z_OK;\n  PyObject *RetVal;\n  int flushmode = Z_FINISH;\n  unsigned long start_total_out;\n\n  int length=DEFAULTALLOC, err = Z_OK;\n  PyObject *RetVal;\n  int flushmode = Z_FINISH;\n  unsigned long start_total_out;\n\n  int length=DEFAULTALLOC, err = Z_OK;\n  PyObject *RetVal;\n  int flushmode = Z_FINISH;\n  unsigned long start_total_out;\n\n  int length=DEFAULTALLOC, err = Z_OK;\n  PyObject *RetVal;\n  int flushmode = Z_FINISH;\n  unsigned long start_total_out;\n\n  int length=DEFAULTALLOC, err = Z_OK;\n  PyObject *RetVal;\n  int flushmode = Z_FINISH;\n  unsigned long start_total_out;\n\n  int length=DEFAULTALLOC, err = Z_OK;\n  PyObject *RetVal;\n  int flushmode = Z_FINISH;\n  unsigned long start_total_out;\n\n  int length=DEFAULTALLOC, err = Z_OK;\n  PyObject *RetVal;\n  int flushmode = Z_FINISH;\n  unsigned long start_total_out;\n\n  int length=DEFAULTALLOC, err = Z_OK;\n  PyObject *RetVal;\n  int flushmode = Z_FINISH;\n  unsigned long start_total_out;\n\n  int length=DEFAULTALLOC, err = Z_OK;\n  PyObject *RetVal;\n  int flushmode = Z_FINISH;\n  unsigned long start_total_out;\n\n  int length=DEFAULTALLOC, err = Z_OK;\n  PyObject *RetVal;\n  int flushmode = Z_FINISH;\n  unsigned long start_total_out;\n\n  int length=DEFAULTALLOC, err = Z_OK;\n  PyObject *RetVal;\n  int flushmode = Z_FINISH;\n  unsigned long start_total_out;\n\n  int length=DEFAULTALLOC, err = Z_OK;\n  PyObject *RetVal;\n  int flushmode = Z_FINISH;\n  unsigned long start_total_out;\n\n  int length=DEFAULTALLOC, err = Z_OK;\n  PyObject *RetVal;\n  int flushmode = Z_FINISH;\n  unsigned long start_total_out;\n\n  int length=DEFAULTALLOC, err = Z_OK;\n  PyObject *RetVal;\n  int flushmode = Z_FINISH;\n  unsigned long start_total_out;\n\n  int length=DEFAULTALLOC, err = Z_OK;\n  PyObject *RetVal;\n  int flushmode = Z_FINISH;\n  unsigned long start_total_out;\n\n  int length=DEFAULTALLOC, err = Z_OK;\n  PyObject *RetVal;\n  int flushmode = Z_FINISH;\n  unsigned long start_total_out;\n\n  int length=DEFAULTALLOC, err = Z_OK;\n  PyObject *RetVal;\n  int flushmode = Z_FINISH;\n  unsigned long start_total_out;\n\n  int length=DEFAULTALLOC, err = Z_OK;\n  PyObject *RetVal;\n  int flushmode = Z_FINISH;\n  unsigned long start_total_out;\n\n  int length=DEFAULTALLOC, err = Z_OK;\n  PyObject *RetVal;\n  int flushmode = Z_FINISH;\n  unsigned long start_total_out;\n\n  int length=DEFAULTALLOC, err = Z_OK;\n  PyObject *RetVal;\n  int flushmode = Z_FINISH;\n  unsigned long start_total_out;\n\n  int length=DEFAULTALLOC, err = Z_OK;\n  PyObject *RetVal;\n  int flushmode = Z_FINISH;\n  unsigned long start_total_out;\n\n  int length=DEFAULTALLOC, err = Z_OK;\n  PyObject *RetVal;\n  int flushmode = Z_FINISH;\n  unsigned long start_total_out;\n\n  int length=DEFAULTALLOC, err = Z_OK;\n  PyObject *RetVal;\n  int flushmode = Z_FINISH;\n  unsigned long start_total_out;\n\n  int length=DEFAULTALLOC, err = Z_OK;\n  PyObject *RetVal;\n  int flushmode = Z_FINISH;\n  unsigned long start_total_out;\n\n  int length=DEFAULTALLOC, err = Z_OK;\n  PyObject *RetVal;\n  int flushmode = Z_FINISH;\n  unsigned long start_total_out;\n\n  int length=DEFAULTALLOC, err = Z_OK;\n  PyObject *RetVal;\n  int flushmode = Z_FINISH;\n  unsigned long start_total_out;\n\n  int length=DEFAULTALLOC, err = Z_OK;\n  PyObject *RetVal;\n  int flushmode = Z_FINISH;\n  unsigned long start_total_out;\n\n  int length=DEFAULTALLOC, err = Z_OK;\n  PyObject *RetVal;\n  int flushmode = Z_FINISH;\n  unsigned long start_total_out;\n\n  int length=DEFAULTALLOC, err = Z_OK;\n  PyObject *RetVal;\n  int flushmode = Z_FINISH;\n  unsigned long start_total_out;\n\n  int length=DEFAULTALLOC, err = Z_OK;\n  PyObject *RetVal;\n  int flushmode = Z_FINISH;\n  unsigned long start_total_out;\n\n  int length=DEFAULTALLOC, err = Z_OK;\n  PyObject *RetVal;\n  int flushmode = Z_FINISH;\n  unsigned long start_total_out;\n\n  int length=DEFAULTALLOC, err = Z_OK;\n  PyObject *RetVal;\n  int flushmode = Z_FINISH;\n  unsigned long start_total_out;\n\n  int length=DEFAULTALLOC, err = Z_OK;\n  PyObject *RetVal;\n  int flushmode = Z_FINISH;\n  unsigned long start_total_out;\n\n  int length=DEFAULTALLOC, err = Z_OK;\n  PyObject *RetVal;\n  int flushmode = Z_FINISH;\n  unsigned long start_total_out;\n\n  int length=DEFAULTALLOC, err = Z_OK;\n  PyObject *RetVal;\n  int flushmode = Z_FINISH;\n  unsigned long start_total_out;\n\n  int length=DEFAULTALLOC, err = Z_OK;\n  PyObject *RetVal;\n  int flushmode = Z_FINISH;\n  unsigned long start_total_out;\n\n  int length=DEFAULTALLOC, err = Z_OK;\n  PyObject *RetVal;\n  int flushmode = Z_FINISH;\n  unsigned long start_total_out;\n\n  int length=DEFAULTALLOC, err = Z_OK;\n  PyObject *RetVal;\n  int flushmode = Z_FINISH;\n  unsigned long start_total_out;\n\n  int length=DEFAULTALLOC, err = Z_OK;\n  PyObject *RetVal;\n  int flushmode = Z_FINISH;\n  unsigned long start_total_out;\n\n  int length=DEFAULTALLOC, err = Z_OK;\n  PyObject *RetVal;\n  int flushmode = Z_FINISH;\n  unsigned long start_total_out;\n\n  int length=DEFAULTALLOC, err = Z_OK;\n  PyObject *RetVal;\n  int flushmode = Z_FINISH;\n  unsigned long start_total_out;\n\n  int length=DEFAULTALLOC, err = Z_OK;\n  PyObject *RetVal;\n  int flushmode = Z_FINISH;\n  unsigned long start_total_out;\n\n  int length=DEFAULTALLOC, err = Z_OK;\n  PyObject *RetVal;\n  int flushmode = Z_FINISH;\n  unsigned long start_total_out;\n\n  int length=DEFAULTALLOC, err = Z_OK;\n  PyObject *RetVal;\n  int flushmode = Z_FINISH;\n  unsigned long start_total_out;\n\n  int length=DEFAULTALLOC, err = Z_OK;\n  PyObject *RetVal;\n  int flushmode = Z_FINISH;\n  unsigned long start_total_out;\n\n  int length=DEFAULTALLOC, err = Z_OK;\n  PyObject *RetVal;\n  int flushmode = Z_FINISH;\n  unsigned long start_total_out;\n\n  int length=DEFAULTALLOC, err = Z_OK;\n  PyObject *RetVal;\n  int flushmode = Z_FINISH;\n  unsigned long start_total_out;\n\n  int length=DEFAULTALLOC, err = Z_OK;\n  PyObject *RetVal;\n  int flushmode = Z_FINISH;\n  unsigned long start_total_out;\n\n  int length=DEFAULTALLOC, err = Z_OK;\n  PyObject *RetVal;\n  int flushmode = Z_FINISH;\n  unsigned long start_total_out;\n\n  int length=DEFAULTALLOC, err = Z_OK;\n  PyObject *RetVal;\n  int flushmode = Z_FINISH;\n  unsigned long start_total_out;\n\n' != '  int length=DEFAULTALLOC, err = Z_OK;\n  PyObject *RetVal;\n  int flushmode = Z_FINISH;\n  unsigned long start_total_out;\n\n  int length=DEFAULTALLOC, err = Z_OK;\n  PyObject *RetVal;\n  int flushmode = Z_FINISH;\n  unsigned long start_total_out;\n\n  int length=DEFAULTALLOC, err = Z_OK;\n  PyObject *RetVal;\n  int flushmode = Z_FINISH;\n  unsigned long start_total_out;\n\n  int length=DEFAULTALLOC, err = Z_OK;\n  PyObject *RetVal;\n  int flushmode = Z_FINISH;\n  unsigned long start_total_out;\n\n  int length=DEFAULTALLOC, err = Z_OK;\n  PyObject *RetVal;\n  int flushmode = Z_FINISH;\n  unsigned long start_total_out;\n\n  int length=DEFAULTALLOC, err = Z_OK;\n  PyObject *RetVal;\n  int flushmode = Z_FINISH;\n  unsigned long start_total_out;\n\n  int length=DEFAULTALLOC, err = Z_OK;\n  PyObject *RetVal;\n  int flushmode = Z_FINISH;\n  unsigned long start_total_out;\n\n  int length=DEFAULTALLOC, err = Z_OK;\n  PyObject *RetVal;\n  int flushmode = Z_FINISH;\n  unsigned long start_total_out;\n\n  int length=DEFAULTALLOC, err = Z_OK;\n  PyObject *RetVal;\n  int flushmode = Z_FINISH;\n  unsigned long start_total_out;\n\n  int length=DEFAULTALLOC, err = Z_OK;\n  PyObject *RetVal;\n  int flushmode = Z_FINISH;\n  unsigned long start_total_out;\n\n  int length=DEFAULTALLOC, err = Z_OK;\n  PyObject *RetVal;\n  int flushmode = Z_FINISH;\n  unsigned long start_total_out;\n\n  int length=DEFAULTALLOC, err = Z_OK;\n  PyObject *RetVal;\n  int flushmode = Z_FINISH;\n  unsigned long start_total_out;\n\n  int length=DEFAULTALLOC, err = Z_OK;\n  PyObject *RetVal;\n  int flushmode = Z_FINISH;\n  unsigned long start_total_out;\n\n  int length=DEFAULTALLOC, err = Z_OK;\n  PyObject *RetVal;\n  int flushmode = Z_FINISH;\n  unsigned long start_total_out;\n\n  int length=DEFAULTALLOC, err = Z_OK;\n  PyObject *RetVal;\n  int flushmode = Z_FINISH;\n  unsigned long start_total_out;\n\n  int length=DEFAULTALLOC, err = Z_OK;\n  PyObject *RetVal;\n  int flushmode = Z_FINISH;\n  unsigned long start_total_out;\n\n  int length=DEFAULTALLOC, err = Z_OK;\n  PyObject *RetVal;\n  int flushmode = Z_FINISH;\n  unsigned long start_total_out;\n\n  int length=DEFAULTALLOC, err = Z_OK;\n  PyObject *RetVal;\n  int flushmode = Z_FINISH;\n  unsigned long start_total_out;\n\n  int length=DEFAULTALLOC, err = Z_OK;\n  PyObject *RetVal;\n  int flushmode = Z_FINISH;\n  unsigned long start_total_out;\n\n  int length=DEFAULTALLOC, err = Z_OK;\n  PyObject *RetVal;\n  int flushmode = Z_FINISH;\n  unsigned long start_total_out;\n\n  int length=DEFAULTALLOC, err = Z_OK;\n  PyObject *RetVal;\n  int flushmode = Z_FINISH;\n  unsigned long start_total_out;\n\n  int length=DEFAULTALLOC, err = Z_OK;\n  PyObject *RetVal;\n  int flushmode = Z_FINISH;\n  unsigned long start_total_out;\n\n  int length=DEFAULTALLOC, err = Z_OK;\n  PyObject *RetVal;\n  int flushmode = Z_FINISH;\n  unsigned long start_total_out;\n\n  int length=DEFAULTALLOC, err = Z_OK;\n  PyObject *RetVal;\n  int flushmode = Z_FINISH;\n  unsigned long start_total_out;\n\n  int length=DEFAULTALLOC, err = Z_OK;\n  PyObject *RetVal;\n  int flushmode = Z_FINISH;\n  unsigned long start_total_out;\n\n  int length=DEFAULTALLOC, err = Z_OK;\n  PyObject *RetVal;\n  int flushmode = Z_FINISH;\n  unsigned long start_total_out;\n\n  int length=DEFAULTALLOC, err = Z_OK;\n  PyObject *RetVal;\n  int flushmode = Z_FINISH;\n  unsigned long start_total_out;\n\n  int length=DEFAULTALLOC, err = Z_OK;\n  PyObject *RetVal;\n  int flushmode = Z_FINISH;\n  unsigned long start_total_out;\n\n  int length=DEFAULTALLOC, err = Z_OK;\n  PyObject *RetVal;\n  int flushmode = Z_FINISH;\n  unsigned long start_total_out;\n\n  int length=DEFAULTALLOC, err = Z_OK;\n  PyObject *RetVal;\n  int flushmode = Z_FINISH;\n  unsigned long start_total_out;\n\n  int length=DEFAULTALLOC, err = Z_OK;\n  PyObject *RetVal;\n  int flushmode = Z_FINISH;\n  unsigned long start_total_out;\n\n  int length=DEFAULTALLOC, err = Z_OK;\n  PyObject *RetVal;\n  int flushmode = Z_FINISH;\n  unsigned long start_total_out;\n\n  int length=DEFAULTALLOC, err = Z_OK;\n  PyObject *RetVal;\n  int flushmode = Z_FINISH;\n  unsigned long start_total_out;\n\n  int length=DEFAULTALLOC, err = Z_OK;\n  PyObject *RetVal;\n  int flushmode = Z_FINISH;\n  unsigned long start_total_out;\n\n  int length=DEFAULTALLOC, err = Z_OK;\n  PyObject *RetVal;\n  int flushmode = Z_FINISH;\n  unsigned long start_total_out;\n\n  int length=DEFAULTALLOC, err = Z_OK;\n  PyObject *RetVal;\n  int flushmode = Z_FINISH;\n  unsigned long start_total_out;\n\n  int length=DEFAULTALLOC, err = Z_OK;\n  PyObject *RetVal;\n  int flushmode = Z_FINISH;\n  unsigned long start_total_out;\n\n  int length=DEFAULTALLOC, err = Z_OK;\n  PyObject *RetVal;\n  int flushmode = Z_FINISH;\n  unsigned long start_total_out;\n\n  int length=DEFAULTALLOC, err = Z_OK;\n  PyObject *RetVal;\n  int flushmode = Z_FINISH;\n  unsigned long start_total_out;\n\n  int length=DEFAULTALLOC, err = Z_OK;\n  PyObject *RetVal;\n  int flushmode = Z_FINISH;\n  unsigned long start_total_out;\n\n  int length=DEFAULTALLOC, err = Z_OK;\n  PyObject *RetVal;\n  int flushmode = Z_FINISH;\n  unsigned long start_total_out;\n\n  int length=DEFAULTALLOC, err = Z_OK;\n  PyObject *RetVal;\n  int flushmode = Z_FINISH;\n  unsigned long start_total_out;\n\n  int length=DEFAULTALLOC, err = Z_OK;\n  PyObject *RetVal;\n  int flushmode = Z_FINISH;\n  unsigned long start_total_out;\n\n  int length=DEFAULTALLOC, err = Z_OK;\n  PyObject *RetVal;\n  int flushmode = Z_FINISH;\n  unsigned long start_total_out;\n\n  int length=DEFAULTALLOC, err = Z_OK;\n  PyObject *RetVal;\n  int flushmode = Z_FINISH;\n  unsigned long start_total_out;\n\n  int length=DEFAULTALLOC, err = Z_OK;\n  PyObject *RetVal;\n  int flushmode = Z_FINISH;\n  unsigned long start_total_out;\n\n  int length=DEFAULTALLOC, err = Z_OK;\n  PyObject *RetVal;\n  int flushmode = Z_FINISH;\n  unsigned long start_total_out;\n\n  int length=DEFAULTALLOC, err = Z_OK;\n  PyObject *RetVal;\n  int flushmode = Z_FINISH;\n  unsigned long start_total_out;\n\n  int length=DEFAULTALLOC, err = Z_OK;\n  PyObject *RetVal;\n  int flushmode = Z_FINISH;\n  unsigned long start_total_out;\n\n  int length=DEFAULTALLOC, err = Z_OK;\n  PyObject *RetVal;\n  int flushmode = Z_FINISH;\n  unsigned long start_total_out;\n\n/* zlibmodule.c -- gzip-compatible data compression */\n/* See http://www.gzip.org/zlib/\n/* See http://www.winimage.com/zLibDll for Windows */\n/* zlibmodule.c -- gzip-compatible data compression */\n/* See http://www.gzip.org/zlib/\n/* See http://www.winimage.com/zLibDll for Windows */\n/* zlibmodule.c -- gzip-compatible data compression */\n/* See http://www.gzip.org/zlib/\n/* See http://www.winimage.com/zLibDll for Windows */\n/* zlibmodule.c -- gzip-compatible data compression */\n/* See http://www.gzip.org/zlib/\n/* See http://www.winimage.com/zLibDll for Windows */\n/* zlibmodule.c -- gzip-compatible data compression */\n/* See http://www.gzip.org/zlib/\n/* See http://www.winimage.com/zLibDll for Windows */\n/* zlibmodule.c -- gzip-compatible data compression */\n/* See http://www.gzip.org/zlib/\n/* See http://www.winimage.com/zLibDll for Windows */\n/* zlibmodule.c -- gzip-compatible data compression */\n/* See http://www.gzip.org/zlib/\n/* See http://www.winimage.com/zLibDll for Windows */\n/* zlibmodule.c -- gzip-compatible data compression */\n/* See http://www.gzip.org/zlib/\n/* See http://www.winimage.com/zLibDll for Windows */\n/* zlibmodule.c -- gzip-compatible data compression */\n/* See http://www.gzip.org/zlib/\n/* See http://www.winimage.com/zLibDll for Windows */\n/* zlibmodule.c -- gzip-compatible data compression */\n/* See http://www.gzip.org/zlib/\n/* See http://www.winimage.com/zLibDll for Windows */\n/* zlibmodule.c -- gzip-compatible data compression */\n/* See http://www.gzip.org/zlib/\n/* See http://www.winimage.com/zLibDll for Windows */\n/* zlibmodule.c -- gzip-compatible data compression */\n/* See http://www.gzip.org/zlib/\n/* See http://www.winimage.com/zLibDll for Windows */\n/* zlibmodule.c -- gzip-compatible data compression */\n/* See http://www.gzip.org/zlib/\n/* See http://www.winimage.com/zLibDll for Windows */\n/* zlibmodule.c -- gzip-compatible data compression */\n/* See http://www.gzip.org/zlib/\n/* See http://www.winimage.com/zLibDll for Windows */\n/* zlibmodule.c -- gzip-compatible data compression */\n/* See http://www.gzip.org/zlib/\n/* See http://www.winimage.com/zLibDll for Windows */\n'

test_hash
test_hashlib
test_heapq
test_hexoct
test_hmac
test_hotshot
test_htmllib
test_htmlparser
test_httplib
test_imageop
test_imaplib
test_imgfile
test_imgfile skipped -- No module named imgfile
test_imp
test_import
test_importhooks
test_index
test_inspect
test_ioctl
test_ioctl skipped -- No fcntl or termios module
test_isinstance
test_iter
test_iterlen
test_itertools
test_largefile
test_largefile skipped -- test requires 2500000000 bytes and a long time to run
test_linuxaudiodev
test_linuxaudiodev skipped -- Use of the `audio' resource not enabled
test_list
test_locale
test test_locale produced unexpected output:
**********************************************************************
*** lines 2-11 of actual output doesn't appear in expected output after line 1:
+ '%+10.f' % -4200 == '     -4200' != '    -4200'
+ '%-10.f' % 4200 == '4200      ' != '4200     '
+ '--> %10.2f' % 1000.0 == '-->    1000.00' != '-->   1000.00'
+ '%*.*f' % (10, 2, 1000.0) == '   1000.00' != '  1000.00'
+ '\xa0'.isspace() == True != False
+ '\xc0'.isalpha() == True != False
+ '\xc0'.isalnum() == True != False
+ '\xc0'.isupper() == True != False
+ '\xec\xa0\xbc'.split() == ['\xec', '\xbc'] != ['\xec\xa0\xbc']
+ '\xed\x95\xa0'.strip() == '\xed\x95' != '\xed\x95\xa0'
**********************************************************************
test_logging
test_long
test_long_future
test_longexp
test_macfs
test_macfs skipped -- No module named macfs
test_macostools
test_macostools skipped -- No module named macostools
test_macpath
test_mailbox
test test_mailbox failed -- errors occurred; run in verbose mode for details
test_marshal
test_math
test_md5
test_mhlib
test_mhlib skipped -- skipped on win32 -- too many Unix assumptions
test_mimetools
test_mimetypes
test_minidom
test_mmap
test_module
test_multibytecodec
test_multibytecodec_support
test_multifile
test_mutants
test_netrc
test_new
test_nis
test_nis skipped -- No module named nis
test_normalization
test_normalization skipped -- Use of the `urlfetch' resource not enabled
test_ntpath
test_old_mailbox
test_openpty
test_openpty skipped -- No openpty() available.
test_operator
test_optparse
test_os
test test_os failed -- errors occurred; run in verbose mode for details
test_ossaudiodev
test_ossaudiodev skipped -- Use of the `audio' resource not enabled
test_parser
test_peepholer
test_pep247
test_pep263
test_pep277
test test_pep277 failed -- errors occurred in test.test_pep277.UnicodeFileTests
test_pep292
test_pep352
test_pickle
test_pickletools
test_pkg
test_pkgimport
test_platform
test_plistlib
test_plistlib skipped -- No module named plistlib
test_poll
test_poll skipped -- select.poll not defined -- skipping test_poll
test_popen
test_popen2
test_posix
test_posix skipped -- posix is not available
test_posixpath
test_pow
test_pprint
test_profile
test_profile skipped -- No module named profile
test_profilehooks
test_pty
test_pty skipped -- No module named termios
test_pwd
test_pwd skipped -- No module named pwd
test_pyclbr
test_pyexpat
test_queue
test_quopri
test_random
test_re
test_repr
test_resource
test_resource skipped -- No module named resource
test_rfc822
test_rgbimg
test_richcmp
test_robotparser
test_runpy
test_sax
test_scope
test_scriptpackages
test_scriptpackages skipped -- No module named aetools
test_select
test_set
test_sets
test_sgmllib
test_sha
test_shelve
test_shlex
test_shutil
test_signal
test_signal skipped -- Can't test signal on win32
test_site
test_slice
test_socket
test test_socket failed -- errors occurred; run in verbose mode for details
test_socket_ssl
test_socket_ssl skipped -- socket module has no ssl support
test_socketserver
test_socketserver skipped -- Use of the `network' resource not enabled
test_softspace
test_sort
test_sqlite
test_sqlite skipped -- no sqlite available
test_startfile
test_str
test_strftime
test_string
test_stringprep
test_strop
test_strptime
test_struct
test_structmembers
test_structseq
test_subprocess
.
    this bit of output is from a test of stdout in a different process ...
test_sunaudiodev
test_sunaudiodev skipped -- No module named sunaudiodev
test_sundry
test_sundry skipped -- No module named pstats
test_symtable
test_syntax
test_sys
test_tarfile
test_tcl
test_tcl skipped -- No module named _tkinter
test_tempfile
test_textwrap
test_thread
test_threaded_import
test_threadedtempfile
test_threading
test_threading_local
test_threadsignals
test_threadsignals skipped -- Can't test signal on win32
test_time
test_timeout
test_timeout skipped -- Use of the `network' resource not enabled
test_tokenize
test_trace
test_traceback
test_transformer
test_tuple
test_ucn
test_unary
test_unicode
test_unicode_file
test test_unicode_file failed -- Traceback (most recent call last):
  File "C:\msys\src\python2.5-2.5.2\lib\test\test_unicode_file.py", line 186, in test_single_files
    self._test_single(TESTFN_UNICODE_UNENCODEABLE)
  File "C:\msys\src\python2.5-2.5.2\lib\test\test_unicode_file.py", line 155, in _test_single
    f = file(filename, "w")
IOError: invalid mode: w

test_unicodedata
test_univnewlines
test_unpack
test_urllib
test_urllib2
test_urllib2_localnet
test_urllib2net
test_urllib2net skipped -- Use of the `network' resource not enabled
test_urllibnet
test_urllibnet skipped -- Use of the `network' resource not enabled
test_urlparse
test_userdict
test_userlist
test_userstring
test_uu
test_uuid
    WARNING: uuid.getnode is unreliable on many platforms.
        It is disabled until the code and/or test can be fixed properly.
    WARNING: uuid._ifconfig_getnode is unreliable on many platforms.
        It is disabled until the code and/or test can be fixed properly.
    WARNING: uuid._unixdll_getnode is unreliable on many platforms.
        It is disabled until the code and/or test can be fixed properly.
test_wait3
test_wait3 skipped -- os.fork not defined -- skipping test_wait3
test_wait4
test_wait4 skipped -- os.fork not defined -- skipping test_wait4
test_warnings
test_wave
test_weakref
test_whichdb
test_winreg
test_winsound
test_winsound skipped -- No module named winsound
test_with
test_wsgiref
test_xdrlib
test_xml_etree
test_xml_etree_c
test_xmllib
test_xmlrpc
test_xpickle
test test_xpickle failed -- Traceback (most recent call last):
  File "C:\msys\src\python2.5-2.5.2\lib\test\pickletester.py", line 506, in test_maxint64
    self.assertEqual(got, maxint64)
AssertionError: 2147483647 != 9223372036854775807L

test_xrange
test_zipfile
test test_zipfile failed -- errors occurred; run in verbose mode for details
test_zipfile64
test_zipfile64 skipped -- test requires loads of disk-space bytes and a long time to run
test_zipimport
test_zlib
250 tests OK.
12 tests failed:
    test_builtin test_cpickle test_file test_gzip test_locale
    test_mailbox test_os test_pep277 test_socket test_unicode_file
    test_xpickle test_zipfile
60 tests skipped:
    test__locale test_aepack test_al test_applesingle test_bsddb
    test_bsddb185 test_bsddb3 test_bz2 test_cProfile test_cd test_cl
    test_codecmaps_cn test_codecmaps_hk test_codecmaps_jp
    test_codecmaps_kr test_codecmaps_tw test_commands test_crypt
    test_curses test_dbm test_dl test_fcntl test_fork1 test_gdbm
    test_gl test_grp test_imgfile test_ioctl test_largefile
    test_linuxaudiodev test_macfs test_macostools test_mhlib test_nis
    test_normalization test_openpty test_ossaudiodev test_plistlib
    test_poll test_posix test_profile test_pty test_pwd test_resource
    test_scriptpackages test_signal test_socket_ssl test_socketserver
    test_sqlite test_sunaudiodev test_sundry test_tcl
    test_threadsignals test_timeout test_urllib2net test_urllibnet
    test_wait3 test_wait4 test_winsound test_zipfile64
8 skips unexpected on win32:
    test_bz2 test_cProfile test_bsddb test_profile test_tcl
    test_sundry test_sqlite test_winsound
./python.exe -E -tt ./Lib/test/regrtest.py -l 
test_grammar
test_opcodes
test_operations
test_builtin
test test_builtin failed -- Traceback (most recent call last):
  File "C:\msys\src\python2.5-2.5.2\lib\test\test_builtin.py", line 1312, in test_open
    self.assertEqual(fp.readline(4), '1+1\n')
AssertionError: '1+1\r' != '1+1\n'

test_exceptions
test_types
test_unittest
test_doctest
test_doctest2
test_MimeWriter
test_StringIO
test___all__
test___future__
test__locale
test__locale skipped -- cannot import name RADIXCHAR
test_aepack
test_aepack skipped -- No module named aepack
test_al
test_al skipped -- No module named al
test_anydbm
test_applesingle
test_applesingle skipped -- No module named macostools
test_array
test_ast
test_asynchat
test_atexit
test_audioop
test_augassign
test_base64
test_bastion
test_bigaddrspace
test_bigmem
test_binascii
test_binhex
test_binop
test_bisect
test_bool
test_bsddb
test_bsddb skipped -- No module named _bsddb
test_bsddb185
test_bsddb185 skipped -- No module named bsddb185
test_bsddb3
test_bsddb3 skipped -- Use of the `bsddb' resource not enabled
test_bufio
test_bz2
test_bz2 skipped -- No module named bz2
test_cProfile
test_cProfile skipped -- No module named pstats
test_calendar
test_call
test_capi
test_cd
test_cd skipped -- No module named cd
test_cfgparser
test_cgi
test_charmapcodec
test_cl
test_cl skipped -- No module named cl
test_class
test_cmath
test_cmd_line
test_code
test_codeccallbacks
test_codecencodings_cn
test_codecencodings_hk
test_codecencodings_jp
test_codecencodings_kr
test_codecencodings_tw
test_codecmaps_cn
test_codecmaps_cn skipped -- Use of the `urlfetch' resource not enabled
test_codecmaps_hk
test_codecmaps_hk skipped -- Use of the `urlfetch' resource not enabled
test_codecmaps_jp
test_codecmaps_jp skipped -- Use of the `urlfetch' resource not enabled
test_codecmaps_kr
test_codecmaps_kr skipped -- Use of the `urlfetch' resource not enabled
test_codecmaps_tw
test_codecmaps_tw skipped -- Use of the `urlfetch' resource not enabled
test_codecs
test_codeop
test_coding
test_coercion
test_colorsys
test_commands
test_commands skipped -- Not posix; skipping test_commands
test_compare
test_compile
test_compiler
test_complex
test_complex_args
test_contains
test_contextlib
test_cookie
test_cookielib
test_copy
test_copy_reg
test_cpickle
test test_cpickle failed -- errors occurred; run in verbose mode for details
test_crypt
test_crypt skipped -- No module named crypt
test_csv
test_ctypes
test_curses
test_curses skipped -- No module named _curses
test_datetime
test_dbm
test_dbm skipped -- No module named dbm
test_decimal
test_decorators
test_defaultdict
test_deque
test_descr
test_descrtut
test_dict
test_difflib
test_dircache
test_dis
test_distutils
test_dl
test_dl skipped -- No module named dl
test_dumbdbm
test_dummy_thread
test_dummy_threading
test_email
test_email_codecs
test_email_renamed
test_enumerate
test_eof
test_errno
test_exception_variations
test_extcall
test_fcntl
test_fcntl skipped -- No module named fcntl
test_file
test test_file failed -- Traceback (most recent call last):
  File "C:\msys\src\python2.5-2.5.2\lib\test\test_file.py", line 323, in testIteration
    os.unlink(TESTFN)
WindowsError: [Error 32] Sharing violation: '@test'

test_filecmp
test_fileinput
test_float
test_fnmatch
test_fork1
test_fork1 skipped -- os.fork not defined -- skipping test_fork1
test_format
test_fpformat
test_frozen
test_funcattrs
test_functools
test_future
test_gc
test_gdbm
test_gdbm skipped -- No module named gdbm
test_generators
test_genexps
test_getargs
test_getargs2
test_getopt
test_gettext
test_gl
test_gl skipped -- No module named gl
test_glob
test_global
test_grp
test_grp skipped -- No module named grp
test_gzip
test test_gzip failed -- Traceback (most recent call last):
  File "C:\msys\src\python2.5-2.5.2\lib\test\test_gzip.py", line 59, in test_append
    self.assertEqual(d, (data1*50) + (data2*15))
AssertionError: '  int length=DEFAULTALLOC, err = Z_OK;\n  PyObject *RetVal;\n  int flushmode = Z_FINISH;\n  unsigned long start_total_out;\n\n  int length=DEFAULTALLOC, err = Z_OK;\n  PyObject *RetVal;\n  int flushmode = Z_FINISH;\n  unsigned long start_total_out;\n\n  int length=DEFAULTALLOC, err = Z_OK;\n  PyObject *RetVal;\n  int flushmode = Z_FINISH;\n  unsigned long start_total_out;\n\n  int length=DEFAULTALLOC, err = Z_OK;\n  PyObject *RetVal;\n  int flushmode = Z_FINISH;\n  unsigned long start_total_out;\n\n  int length=DEFAULTALLOC, err = Z_OK;\n  PyObject *RetVal;\n  int flushmode = Z_FINISH;\n  unsigned long start_total_out;\n\n  int length=DEFAULTALLOC, err = Z_OK;\n  PyObject *RetVal;\n  int flushmode = Z_FINISH;\n  unsigned long start_total_out;\n\n  int length=DEFAULTALLOC, err = Z_OK;\n  PyObject *RetVal;\n  int flushmode = Z_FINISH;\n  unsigned long start_total_out;\n\n  int length=DEFAULTALLOC, err = Z_OK;\n  PyObject *RetVal;\n  int flushmode = Z_FINISH;\n  unsigned long start_total_out;\n\n  int length=DEFAULTALLOC, err = Z_OK;\n  PyObject *RetVal;\n  int flushmode = Z_FINISH;\n  unsigned long start_total_out;\n\n  int length=DEFAULTALLOC, err = Z_OK;\n  PyObject *RetVal;\n  int flushmode = Z_FINISH;\n  unsigned long start_total_out;\n\n  int length=DEFAULTALLOC, err = Z_OK;\n  PyObject *RetVal;\n  int flushmode = Z_FINISH;\n  unsigned long start_total_out;\n\n  int length=DEFAULTALLOC, err = Z_OK;\n  PyObject *RetVal;\n  int flushmode = Z_FINISH;\n  unsigned long start_total_out;\n\n  int length=DEFAULTALLOC, err = Z_OK;\n  PyObject *RetVal;\n  int flushmode = Z_FINISH;\n  unsigned long start_total_out;\n\n  int length=DEFAULTALLOC, err = Z_OK;\n  PyObject *RetVal;\n  int flushmode = Z_FINISH;\n  unsigned long start_total_out;\n\n  int length=DEFAULTALLOC, err = Z_OK;\n  PyObject *RetVal;\n  int flushmode = Z_FINISH;\n  unsigned long start_total_out;\n\n  int length=DEFAULTALLOC, err = Z_OK;\n  PyObject *RetVal;\n  int flushmode = Z_FINISH;\n  unsigned long start_total_out;\n\n  int length=DEFAULTALLOC, err = Z_OK;\n  PyObject *RetVal;\n  int flushmode = Z_FINISH;\n  unsigned long start_total_out;\n\n  int length=DEFAULTALLOC, err = Z_OK;\n  PyObject *RetVal;\n  int flushmode = Z_FINISH;\n  unsigned long start_total_out;\n\n  int length=DEFAULTALLOC, err = Z_OK;\n  PyObject *RetVal;\n  int flushmode = Z_FINISH;\n  unsigned long start_total_out;\n\n  int length=DEFAULTALLOC, err = Z_OK;\n  PyObject *RetVal;\n  int flushmode = Z_FINISH;\n  unsigned long start_total_out;\n\n  int length=DEFAULTALLOC, err = Z_OK;\n  PyObject *RetVal;\n  int flushmode = Z_FINISH;\n  unsigned long start_total_out;\n\n  int length=DEFAULTALLOC, err = Z_OK;\n  PyObject *RetVal;\n  int flushmode = Z_FINISH;\n  unsigned long start_total_out;\n\n  int length=DEFAULTALLOC, err = Z_OK;\n  PyObject *RetVal;\n  int flushmode = Z_FINISH;\n  unsigned long start_total_out;\n\n  int length=DEFAULTALLOC, err = Z_OK;\n  PyObject *RetVal;\n  int flushmode = Z_FINISH;\n  unsigned long start_total_out;\n\n  int length=DEFAULTALLOC, err = Z_OK;\n  PyObject *RetVal;\n  int flushmode = Z_FINISH;\n  unsigned long start_total_out;\n\n  int length=DEFAULTALLOC, err = Z_OK;\n  PyObject *RetVal;\n  int flushmode = Z_FINISH;\n  unsigned long start_total_out;\n\n  int length=DEFAULTALLOC, err = Z_OK;\n  PyObject *RetVal;\n  int flushmode = Z_FINISH;\n  unsigned long start_total_out;\n\n  int length=DEFAULTALLOC, err = Z_OK;\n  PyObject *RetVal;\n  int flushmode = Z_FINISH;\n  unsigned long start_total_out;\n\n  int length=DEFAULTALLOC, err = Z_OK;\n  PyObject *RetVal;\n  int flushmode = Z_FINISH;\n  unsigned long start_total_out;\n\n  int length=DEFAULTALLOC, err = Z_OK;\n  PyObject *RetVal;\n  int flushmode = Z_FINISH;\n  unsigned long start_total_out;\n\n  int length=DEFAULTALLOC, err = Z_OK;\n  PyObject *RetVal;\n  int flushmode = Z_FINISH;\n  unsigned long start_total_out;\n\n  int length=DEFAULTALLOC, err = Z_OK;\n  PyObject *RetVal;\n  int flushmode = Z_FINISH;\n  unsigned long start_total_out;\n\n  int length=DEFAULTALLOC, err = Z_OK;\n  PyObject *RetVal;\n  int flushmode = Z_FINISH;\n  unsigned long start_total_out;\n\n  int length=DEFAULTALLOC, err = Z_OK;\n  PyObject *RetVal;\n  int flushmode = Z_FINISH;\n  unsigned long start_total_out;\n\n  int length=DEFAULTALLOC, err = Z_OK;\n  PyObject *RetVal;\n  int flushmode = Z_FINISH;\n  unsigned long start_total_out;\n\n  int length=DEFAULTALLOC, err = Z_OK;\n  PyObject *RetVal;\n  int flushmode = Z_FINISH;\n  unsigned long start_total_out;\n\n  int length=DEFAULTALLOC, err = Z_OK;\n  PyObject *RetVal;\n  int flushmode = Z_FINISH;\n  unsigned long start_total_out;\n\n  int length=DEFAULTALLOC, err = Z_OK;\n  PyObject *RetVal;\n  int flushmode = Z_FINISH;\n  unsigned long start_total_out;\n\n  int length=DEFAULTALLOC, err = Z_OK;\n  PyObject *RetVal;\n  int flushmode = Z_FINISH;\n  unsigned long start_total_out;\n\n  int length=DEFAULTALLOC, err = Z_OK;\n  PyObject *RetVal;\n  int flushmode = Z_FINISH;\n  unsigned long start_total_out;\n\n  int length=DEFAULTALLOC, err = Z_OK;\n  PyObject *RetVal;\n  int flushmode = Z_FINISH;\n  unsigned long start_total_out;\n\n  int length=DEFAULTALLOC, err = Z_OK;\n  PyObject *RetVal;\n  int flushmode = Z_FINISH;\n  unsigned long start_total_out;\n\n  int length=DEFAULTALLOC, err = Z_OK;\n  PyObject *RetVal;\n  int flushmode = Z_FINISH;\n  unsigned long start_total_out;\n\n  int length=DEFAULTALLOC, err = Z_OK;\n  PyObject *RetVal;\n  int flushmode = Z_FINISH;\n  unsigned long start_total_out;\n\n  int length=DEFAULTALLOC, err = Z_OK;\n  PyObject *RetVal;\n  int flushmode = Z_FINISH;\n  unsigned long start_total_out;\n\n  int length=DEFAULTALLOC, err = Z_OK;\n  PyObject *RetVal;\n  int flushmode = Z_FINISH;\n  unsigned long start_total_out;\n\n  int length=DEFAULTALLOC, err = Z_OK;\n  PyObject *RetVal;\n  int flushmode = Z_FINISH;\n  unsigned long start_total_out;\n\n  int length=DEFAULTALLOC, err = Z_OK;\n  PyObject *RetVal;\n  int flushmode = Z_FINISH;\n  unsigned long start_total_out;\n\n  int length=DEFAULTALLOC, err = Z_OK;\n  PyObject *RetVal;\n  int flushmode = Z_FINISH;\n  unsigned long start_total_out;\n\n  int length=DEFAULTALLOC, err = Z_OK;\n  PyObject *RetVal;\n  int flushmode = Z_FINISH;\n  unsigned long start_total_out;\n\n' != '  int length=DEFAULTALLOC, err = Z_OK;\n  PyObject *RetVal;\n  int flushmode = Z_FINISH;\n  unsigned long start_total_out;\n\n  int length=DEFAULTALLOC, err = Z_OK;\n  PyObject *RetVal;\n  int flushmode = Z_FINISH;\n  unsigned long start_total_out;\n\n  int length=DEFAULTALLOC, err = Z_OK;\n  PyObject *RetVal;\n  int flushmode = Z_FINISH;\n  unsigned long start_total_out;\n\n  int length=DEFAULTALLOC, err = Z_OK;\n  PyObject *RetVal;\n  int flushmode = Z_FINISH;\n  unsigned long start_total_out;\n\n  int length=DEFAULTALLOC, err = Z_OK;\n  PyObject *RetVal;\n  int flushmode = Z_FINISH;\n  unsigned long start_total_out;\n\n  int length=DEFAULTALLOC, err = Z_OK;\n  PyObject *RetVal;\n  int flushmode = Z_FINISH;\n  unsigned long start_total_out;\n\n  int length=DEFAULTALLOC, err = Z_OK;\n  PyObject *RetVal;\n  int flushmode = Z_FINISH;\n  unsigned long start_total_out;\n\n  int length=DEFAULTALLOC, err = Z_OK;\n  PyObject *RetVal;\n  int flushmode = Z_FINISH;\n  unsigned long start_total_out;\n\n  int length=DEFAULTALLOC, err = Z_OK;\n  PyObject *RetVal;\n  int flushmode = Z_FINISH;\n  unsigned long start_total_out;\n\n  int length=DEFAULTALLOC, err = Z_OK;\n  PyObject *RetVal;\n  int flushmode = Z_FINISH;\n  unsigned long start_total_out;\n\n  int length=DEFAULTALLOC, err = Z_OK;\n  PyObject *RetVal;\n  int flushmode = Z_FINISH;\n  unsigned long start_total_out;\n\n  int length=DEFAULTALLOC, err = Z_OK;\n  PyObject *RetVal;\n  int flushmode = Z_FINISH;\n  unsigned long start_total_out;\n\n  int length=DEFAULTALLOC, err = Z_OK;\n  PyObject *RetVal;\n  int flushmode = Z_FINISH;\n  unsigned long start_total_out;\n\n  int length=DEFAULTALLOC, err = Z_OK;\n  PyObject *RetVal;\n  int flushmode = Z_FINISH;\n  unsigned long start_total_out;\n\n  int length=DEFAULTALLOC, err = Z_OK;\n  PyObject *RetVal;\n  int flushmode = Z_FINISH;\n  unsigned long start_total_out;\n\n  int length=DEFAULTALLOC, err = Z_OK;\n  PyObject *RetVal;\n  int flushmode = Z_FINISH;\n  unsigned long start_total_out;\n\n  int length=DEFAULTALLOC, err = Z_OK;\n  PyObject *RetVal;\n  int flushmode = Z_FINISH;\n  unsigned long start_total_out;\n\n  int length=DEFAULTALLOC, err = Z_OK;\n  PyObject *RetVal;\n  int flushmode = Z_FINISH;\n  unsigned long start_total_out;\n\n  int length=DEFAULTALLOC, err = Z_OK;\n  PyObject *RetVal;\n  int flushmode = Z_FINISH;\n  unsigned long start_total_out;\n\n  int length=DEFAULTALLOC, err = Z_OK;\n  PyObject *RetVal;\n  int flushmode = Z_FINISH;\n  unsigned long start_total_out;\n\n  int length=DEFAULTALLOC, err = Z_OK;\n  PyObject *RetVal;\n  int flushmode = Z_FINISH;\n  unsigned long start_total_out;\n\n  int length=DEFAULTALLOC, err = Z_OK;\n  PyObject *RetVal;\n  int flushmode = Z_FINISH;\n  unsigned long start_total_out;\n\n  int length=DEFAULTALLOC, err = Z_OK;\n  PyObject *RetVal;\n  int flushmode = Z_FINISH;\n  unsigned long start_total_out;\n\n  int length=DEFAULTALLOC, err = Z_OK;\n  PyObject *RetVal;\n  int flushmode = Z_FINISH;\n  unsigned long start_total_out;\n\n  int length=DEFAULTALLOC, err = Z_OK;\n  PyObject *RetVal;\n  int flushmode = Z_FINISH;\n  unsigned long start_total_out;\n\n  int length=DEFAULTALLOC, err = Z_OK;\n  PyObject *RetVal;\n  int flushmode = Z_FINISH;\n  unsigned long start_total_out;\n\n  int length=DEFAULTALLOC, err = Z_OK;\n  PyObject *RetVal;\n  int flushmode = Z_FINISH;\n  unsigned long start_total_out;\n\n  int length=DEFAULTALLOC, err = Z_OK;\n  PyObject *RetVal;\n  int flushmode = Z_FINISH;\n  unsigned long start_total_out;\n\n  int length=DEFAULTALLOC, err = Z_OK;\n  PyObject *RetVal;\n  int flushmode = Z_FINISH;\n  unsigned long start_total_out;\n\n  int length=DEFAULTALLOC, err = Z_OK;\n  PyObject *RetVal;\n  int flushmode = Z_FINISH;\n  unsigned long start_total_out;\n\n  int length=DEFAULTALLOC, err = Z_OK;\n  PyObject *RetVal;\n  int flushmode = Z_FINISH;\n  unsigned long start_total_out;\n\n  int length=DEFAULTALLOC, err = Z_OK;\n  PyObject *RetVal;\n  int flushmode = Z_FINISH;\n  unsigned long start_total_out;\n\n  int length=DEFAULTALLOC, err = Z_OK;\n  PyObject *RetVal;\n  int flushmode = Z_FINISH;\n  unsigned long start_total_out;\n\n  int length=DEFAULTALLOC, err = Z_OK;\n  PyObject *RetVal;\n  int flushmode = Z_FINISH;\n  unsigned long start_total_out;\n\n  int length=DEFAULTALLOC, err = Z_OK;\n  PyObject *RetVal;\n  int flushmode = Z_FINISH;\n  unsigned long start_total_out;\n\n  int length=DEFAULTALLOC, err = Z_OK;\n  PyObject *RetVal;\n  int flushmode = Z_FINISH;\n  unsigned long start_total_out;\n\n  int length=DEFAULTALLOC, err = Z_OK;\n  PyObject *RetVal;\n  int flushmode = Z_FINISH;\n  unsigned long start_total_out;\n\n  int length=DEFAULTALLOC, err = Z_OK;\n  PyObject *RetVal;\n  int flushmode = Z_FINISH;\n  unsigned long start_total_out;\n\n  int length=DEFAULTALLOC, err = Z_OK;\n  PyObject *RetVal;\n  int flushmode = Z_FINISH;\n  unsigned long start_total_out;\n\n  int length=DEFAULTALLOC, err = Z_OK;\n  PyObject *RetVal;\n  int flushmode = Z_FINISH;\n  unsigned long start_total_out;\n\n  int length=DEFAULTALLOC, err = Z_OK;\n  PyObject *RetVal;\n  int flushmode = Z_FINISH;\n  unsigned long start_total_out;\n\n  int length=DEFAULTALLOC, err = Z_OK;\n  PyObject *RetVal;\n  int flushmode = Z_FINISH;\n  unsigned long start_total_out;\n\n  int length=DEFAULTALLOC, err = Z_OK;\n  PyObject *RetVal;\n  int flushmode = Z_FINISH;\n  unsigned long start_total_out;\n\n  int length=DEFAULTALLOC, err = Z_OK;\n  PyObject *RetVal;\n  int flushmode = Z_FINISH;\n  unsigned long start_total_out;\n\n  int length=DEFAULTALLOC, err = Z_OK;\n  PyObject *RetVal;\n  int flushmode = Z_FINISH;\n  unsigned long start_total_out;\n\n  int length=DEFAULTALLOC, err = Z_OK;\n  PyObject *RetVal;\n  int flushmode = Z_FINISH;\n  unsigned long start_total_out;\n\n  int length=DEFAULTALLOC, err = Z_OK;\n  PyObject *RetVal;\n  int flushmode = Z_FINISH;\n  unsigned long start_total_out;\n\n  int length=DEFAULTALLOC, err = Z_OK;\n  PyObject *RetVal;\n  int flushmode = Z_FINISH;\n  unsigned long start_total_out;\n\n  int length=DEFAULTALLOC, err = Z_OK;\n  PyObject *RetVal;\n  int flushmode = Z_FINISH;\n  unsigned long start_total_out;\n\n  int length=DEFAULTALLOC, err = Z_OK;\n  PyObject *RetVal;\n  int flushmode = Z_FINISH;\n  unsigned long start_total_out;\n\n/* zlibmodule.c -- gzip-compatible data compression */\n/* See http://www.gzip.org/zlib/\n/* See http://www.winimage.com/zLibDll for Windows */\n/* zlibmodule.c -- gzip-compatible data compression */\n/* See http://www.gzip.org/zlib/\n/* See http://www.winimage.com/zLibDll for Windows */\n/* zlibmodule.c -- gzip-compatible data compression */\n/* See http://www.gzip.org/zlib/\n/* See http://www.winimage.com/zLibDll for Windows */\n/* zlibmodule.c -- gzip-compatible data compression */\n/* See http://www.gzip.org/zlib/\n/* See http://www.winimage.com/zLibDll for Windows */\n/* zlibmodule.c -- gzip-compatible data compression */\n/* See http://www.gzip.org/zlib/\n/* See http://www.winimage.com/zLibDll for Windows */\n/* zlibmodule.c -- gzip-compatible data compression */\n/* See http://www.gzip.org/zlib/\n/* See http://www.winimage.com/zLibDll for Windows */\n/* zlibmodule.c -- gzip-compatible data compression */\n/* See http://www.gzip.org/zlib/\n/* See http://www.winimage.com/zLibDll for Windows */\n/* zlibmodule.c -- gzip-compatible data compression */\n/* See http://www.gzip.org/zlib/\n/* See http://www.winimage.com/zLibDll for Windows */\n/* zlibmodule.c -- gzip-compatible data compression */\n/* See http://www.gzip.org/zlib/\n/* See http://www.winimage.com/zLibDll for Windows */\n/* zlibmodule.c -- gzip-compatible data compression */\n/* See http://www.gzip.org/zlib/\n/* See http://www.winimage.com/zLibDll for Windows */\n/* zlibmodule.c -- gzip-compatible data compression */\n/* See http://www.gzip.org/zlib/\n/* See http://www.winimage.com/zLibDll for Windows */\n/* zlibmodule.c -- gzip-compatible data compression */\n/* See http://www.gzip.org/zlib/\n/* See http://www.winimage.com/zLibDll for Windows */\n/* zlibmodule.c -- gzip-compatible data compression */\n/* See http://www.gzip.org/zlib/\n/* See http://www.winimage.com/zLibDll for Windows */\n/* zlibmodule.c -- gzip-compatible data compression */\n/* See http://www.gzip.org/zlib/\n/* See http://www.winimage.com/zLibDll for Windows */\n/* zlibmodule.c -- gzip-compatible data compression */\n/* See http://www.gzip.org/zlib/\n/* See http://www.winimage.com/zLibDll for Windows */\n'

test_hash
test_hashlib
test_heapq
test_hexoct
test_hmac
test_hotshot
test_htmllib
test_htmlparser
test_httplib
test_imageop
test_imaplib
test_imgfile
test_imgfile skipped -- No module named imgfile
test_imp
test_import
test_importhooks
test_index
test_inspect
test_ioctl
test_ioctl skipped -- No fcntl or termios module
test_isinstance
test_iter
test_iterlen
test_itertools
test_largefile
test_largefile skipped -- test requires 2500000000 bytes and a long time to run
test_linuxaudiodev
test_linuxaudiodev skipped -- Use of the `audio' resource not enabled
test_list
test_locale
test test_locale produced unexpected output:
**********************************************************************
*** lines 2-11 of actual output doesn't appear in expected output after line 1:
+ '%+10.f' % -4200 == '     -4200' != '    -4200'
+ '%-10.f' % 4200 == '4200      ' != '4200     '
+ '--> %10.2f' % 1000.0 == '-->    1000.00' != '-->   1000.00'
+ '%*.*f' % (10, 2, 1000.0) == '   1000.00' != '  1000.00'
+ '\xa0'.isspace() == True != False
+ '\xc0'.isalpha() == True != False
+ '\xc0'.isalnum() == True != False
+ '\xc0'.isupper() == True != False
+ '\xec\xa0\xbc'.split() == ['\xec', '\xbc'] != ['\xec\xa0\xbc']
+ '\xed\x95\xa0'.strip() == '\xed\x95' != '\xed\x95\xa0'
**********************************************************************
test_logging
test_long
test_long_future
test_longexp
test_macfs
test_macfs skipped -- No module named macfs
test_macostools
test_macostools skipped -- No module named macostools
test_macpath
test_mailbox
test test_mailbox failed -- errors occurred; run in verbose mode for details
test_marshal
test_math
test_md5
test_mhlib
test_mhlib skipped -- skipped on win32 -- too many Unix assumptions
test_mimetools
test_mimetypes
test_minidom
test_mmap
test_module
test_multibytecodec
test_multibytecodec_support
test_multifile
test_mutants
test_netrc
test_new
test_nis
test_nis skipped -- No module named nis
test_normalization
test_normalization skipped -- Use of the `urlfetch' resource not enabled
test_ntpath
test_old_mailbox
test_openpty
test_openpty skipped -- No openpty() available.
test_operator
test_optparse
test_os
test test_os failed -- errors occurred; run in verbose mode for details
test_ossaudiodev
test_ossaudiodev skipped -- Use of the `audio' resource not enabled
test_parser
test_peepholer
test_pep247
test_pep263
test_pep277
test test_pep277 failed -- errors occurred in test.test_pep277.UnicodeFileTests
test_pep292
test_pep352
test_pickle
test_pickletools
test_pkg
test_pkgimport
test_platform
test_plistlib
test_plistlib skipped -- No module named plistlib
test_poll
test_poll skipped -- select.poll not defined -- skipping test_poll
test_popen
test_popen2
test_posix
test_posix skipped -- posix is not available
test_posixpath
test_pow
test_pprint
test_profile
test_profile skipped -- No module named profile
test_profilehooks
test_pty
test_pty skipped -- No module named termios
test_pwd
test_pwd skipped -- No module named pwd
test_pyclbr
test_pyexpat
test_queue
test_quopri
test_random
test_re
test_repr
test_resource
test_resource skipped -- No module named resource
test_rfc822
test_rgbimg
test_richcmp
test_robotparser
test_runpy
test_sax
test_scope
test_scriptpackages
test_scriptpackages skipped -- No module named aetools
test_select
test_set
test_sets
test_sgmllib
test_sha
test_shelve
test_shlex
test_shutil
test_signal
test_signal skipped -- Can't test signal on win32
test_site
test_slice
test_socket
test test_socket failed -- errors occurred; run in verbose mode for details
test_socket_ssl
test_socket_ssl skipped -- socket module has no ssl support
test_socketserver
test_socketserver skipped -- Use of the `network' resource not enabled
test_softspace
test_sort
test_sqlite
test_sqlite skipped -- no sqlite available
test_startfile
test_str
test_strftime
test_string
test_stringprep
test_strop
test_strptime
test_struct
test_structmembers
test_structseq
test_subprocess
.
    this bit of output is from a test of stdout in a different process ...
test_sunaudiodev
test_sunaudiodev skipped -- No module named sunaudiodev
test_sundry
test_sundry skipped -- No module named pstats
test_symtable
test_syntax
test_sys
test_tarfile
test_tcl
test_tcl skipped -- No module named _tkinter
test_tempfile
test_textwrap
test_thread
test_threaded_import
test_threadedtempfile
test_threading
test_threading_local
test_threadsignals
test_threadsignals skipped -- Can't test signal on win32
test_time
test_timeout
test_timeout skipped -- Use of the `network' resource not enabled
test_tokenize
test_trace
test_traceback
test_transformer
test_tuple
test_ucn
test_unary
test_unicode
test_unicode_file
test test_unicode_file failed -- Traceback (most recent call last):
  File "C:\msys\src\python2.5-2.5.2\lib\test\test_unicode_file.py", line 186, in test_single_files
    self._test_single(TESTFN_UNICODE_UNENCODEABLE)
  File "C:\msys\src\python2.5-2.5.2\lib\test\test_unicode_file.py", line 155, in _test_single
    f = file(filename, "w")
IOError: invalid mode: w

test_unicodedata
test_univnewlines
test_unpack
test_urllib
test_urllib2
test_urllib2_localnet
test_urllib2net
test_urllib2net skipped -- Use of the `network' resource not enabled
test_urllibnet
test_urllibnet skipped -- Use of the `network' resource not enabled
test_urlparse
test_userdict
test_userlist
test_userstring
test_uu
test_uuid
    WARNING: uuid.getnode is unreliable on many platforms.
        It is disabled until the code and/or test can be fixed properly.
    WARNING: uuid._ifconfig_getnode is unreliable on many platforms.
        It is disabled until the code and/or test can be fixed properly.
    WARNING: uuid._unixdll_getnode is unreliable on many platforms.
        It is disabled until the code and/or test can be fixed properly.
test_wait3
test_wait3 skipped -- os.fork not defined -- skipping test_wait3
test_wait4
test_wait4 skipped -- os.fork not defined -- skipping test_wait4
test_warnings
test_wave
test_weakref
test_whichdb
test_winreg
test_winsound
test_winsound skipped -- No module named winsound
test_with
test_wsgiref
test_xdrlib
test_xml_etree
test_xml_etree_c
test_xmllib
test_xmlrpc
test_xpickle
test test_xpickle failed -- Traceback (most recent call last):
  File "C:\msys\src\python2.5-2.5.2\lib\test\pickletester.py", line 506, in test_maxint64
    self.assertEqual(got, maxint64)
AssertionError: 2147483647 != 9223372036854775807L

test_xrange
test_zipfile
test test_zipfile failed -- errors occurred; run in verbose mode for details
test_zipfile64
test_zipfile64 skipped -- test requires loads of disk-space bytes and a long time to run
test_zipimport
test_zlib
250 tests OK.
12 tests failed:
    test_builtin test_cpickle test_file test_gzip test_locale
    test_mailbox test_os test_pep277 test_socket test_unicode_file
    test_xpickle test_zipfile
60 tests skipped:
    test__locale test_aepack test_al test_applesingle test_bsddb
    test_bsddb185 test_bsddb3 test_bz2 test_cProfile test_cd test_cl
    test_codecmaps_cn test_codecmaps_hk test_codecmaps_jp
    test_codecmaps_kr test_codecmaps_tw test_commands test_crypt
    test_curses test_dbm test_dl test_fcntl test_fork1 test_gdbm
    test_gl test_grp test_imgfile test_ioctl test_largefile
    test_linuxaudiodev test_macfs test_macostools test_mhlib test_nis
    test_normalization test_openpty test_ossaudiodev test_plistlib
    test_poll test_posix test_profile test_pty test_pwd test_resource
    test_scriptpackages test_signal test_socket_ssl test_socketserver
    test_sqlite test_sunaudiodev test_sundry test_tcl
    test_threadsignals test_timeout test_urllib2net test_urllibnet
    test_wait3 test_wait4 test_winsound test_zipfile64
8 skips unexpected on win32:
    test_bz2 test_cProfile test_bsddb test_profile test_tcl
    test_sundry test_sqlite test_winsound
