gcc -c -fno-strict-aliasing -DNDEBUG -g -fwrapv -O3 -Wall -Wstrict-prototypes  -I. -IInclude -I./Include   -DPy_BUILD_CORE -o Python/future.o Python/future.c
gcc -c -fno-strict-aliasing -DNDEBUG -g -fwrapv -O3 -Wall -Wstrict-prototypes  -I. -IInclude -I./Include   -DPy_BUILD_CORE -o Python/getargs.o Python/getargs.c
gcc -c -fno-strict-aliasing -DNDEBUG -g -fwrapv -O3 -Wall -Wstrict-prototypes  -I. -IInclude -I./Include   -DPy_BUILD_CORE -o Python/getcompiler.o Python/getcompiler.c
gcc -c -fno-strict-aliasing -DNDEBUG -g -fwrapv -O3 -Wall -Wstrict-prototypes  -I. -IInclude -I./Include   -DPy_BUILD_CORE -o Python/getcopyright.o Python/getcopyright.c
gcc -c -fno-strict-aliasing -DNDEBUG -g -fwrapv -O3 -Wall -Wstrict-prototypes  -I. -IInclude -I./Include   -DPy_BUILD_CORE -DPLATFORM='"cygwin"' -o Python/getplatform.o ./Python/getplatform.c
gcc -c -fno-strict-aliasing -DNDEBUG -g -fwrapv -O3 -Wall -Wstrict-prototypes  -I. -IInclude -I./Include   -DPy_BUILD_CORE -o Python/getversion.o Python/getversion.c
gcc -c -fno-strict-aliasing -DNDEBUG -g -fwrapv -O3 -Wall -Wstrict-prototypes  -I. -IInclude -I./Include   -DPy_BUILD_CORE -o Python/graminit.o Python/graminit.c
gcc -c -fno-strict-aliasing -DNDEBUG -g -fwrapv -O3 -Wall -Wstrict-prototypes  -I. -IInclude -I./Include   -DPy_BUILD_CORE -o Python/import.o Python/import.c
gcc -c -fno-strict-aliasing -DNDEBUG -g -fwrapv -O3 -Wall -Wstrict-prototypes  -I. -IInclude -I./Include   -DPy_BUILD_CORE -I. -o Python/importdl.o ./Python/importdl.c
gcc -c -fno-strict-aliasing -DNDEBUG -g -fwrapv -O3 -Wall -Wstrict-prototypes  -I. -IInclude -I./Include   -DPy_BUILD_CORE -o Python/marshal.o Python/marshal.c
gcc -c -fno-strict-aliasing -DNDEBUG -g -fwrapv -O3 -Wall -Wstrict-prototypes  -I. -IInclude -I./Include   -DPy_BUILD_CORE -o Python/modsupport.o Python/modsupport.c
gcc -c -fno-strict-aliasing -DNDEBUG -g -fwrapv -O3 -Wall -Wstrict-prototypes  -I. -IInclude -I./Include   -DPy_BUILD_CORE -o Python/mystrtoul.o Python/mystrtoul.c
gcc -c -fno-strict-aliasing -DNDEBUG -g -fwrapv -O3 -Wall -Wstrict-prototypes  -I. -IInclude -I./Include   -DPy_BUILD_CORE -o Python/peephole.o Python/peephole.c
gcc -c -fno-strict-aliasing -DNDEBUG -g -fwrapv -O3 -Wall -Wstrict-prototypes  -I. -IInclude -I./Include   -DPy_BUILD_CORE -o Python/pyarena.o Python/pyarena.c
gcc -c -fno-strict-aliasing -DNDEBUG -g -fwrapv -O3 -Wall -Wstrict-prototypes  -I. -IInclude -I./Include   -DPy_BUILD_CORE -o Python/pyctype.o Python/pyctype.c
gcc -c -fno-strict-aliasing -DNDEBUG -g -fwrapv -O3 -Wall -Wstrict-prototypes  -I. -IInclude -I./Include   -DPy_BUILD_CORE -o Python/pyfpe.o Python/pyfpe.c
gcc -c -fno-strict-aliasing -DNDEBUG -g -fwrapv -O3 -Wall -Wstrict-prototypes  -I. -IInclude -I./Include   -DPy_BUILD_CORE -o Python/pymath.o Python/pymath.c
gcc -c -fno-strict-aliasing -DNDEBUG -g -fwrapv -O3 -Wall -Wstrict-prototypes  -I. -IInclude -I./Include   -DPy_BUILD_CORE -o Python/pystate.o Python/pystate.c
gcc -c -fno-strict-aliasing -DNDEBUG -g -fwrapv -O3 -Wall -Wstrict-prototypes  -I. -IInclude -I./Include   -DPy_BUILD_CORE -o Python/pythonrun.o Python/pythonrun.c
gcc -c -fno-strict-aliasing -DNDEBUG -g -fwrapv -O3 -Wall -Wstrict-prototypes  -I. -IInclude -I./Include   -DPy_BUILD_CORE -o Python/structmember.o Python/structmember.c
gcc -c -fno-strict-aliasing -DNDEBUG -g -fwrapv -O3 -Wall -Wstrict-prototypes  -I. -IInclude -I./Include   -DPy_BUILD_CORE -o Python/symtable.o Python/symtable.c
gcc -c -fno-strict-aliasing -DNDEBUG -g -fwrapv -O3 -Wall -Wstrict-prototypes  -I. -IInclude -I./Include   -DPy_BUILD_CORE -o Python/sysmodule.o Python/sysmodule.c
gcc -c -fno-strict-aliasing -DNDEBUG -g -fwrapv -O3 -Wall -Wstrict-prototypes  -I. -IInclude -I./Include   -DPy_BUILD_CORE -o Python/traceback.o Python/traceback.c
gcc -c -fno-strict-aliasing -DNDEBUG -g -fwrapv -O3 -Wall -Wstrict-prototypes  -I. -IInclude -I./Include   -DPy_BUILD_CORE -o Python/getopt.o Python/getopt.c
gcc -c -fno-strict-aliasing -DNDEBUG -g -fwrapv -O3 -Wall -Wstrict-prototypes  -I. -IInclude -I./Include   -DPy_BUILD_CORE -o Python/pystrcmp.o Python/pystrcmp.c
gcc -c -fno-strict-aliasing -DNDEBUG -g -fwrapv -O3 -Wall -Wstrict-prototypes  -I. -IInclude -I./Include   -DPy_BUILD_CORE -o Python/pystrtod.o Python/pystrtod.c
gcc -c -fno-strict-aliasing -DNDEBUG -g -fwrapv -O3 -Wall -Wstrict-prototypes  -I. -IInclude -I./Include   -DPy_BUILD_CORE -o Python/dtoa.o Python/dtoa.c
gcc -c -fno-strict-aliasing -DNDEBUG -g -fwrapv -O3 -Wall -Wstrict-prototypes  -I. -IInclude -I./Include   -DPy_BUILD_CORE -o Python/formatter_unicode.o Python/formatter_unicode.c
gcc -c -fno-strict-aliasing -DNDEBUG -g -fwrapv -O3 -Wall -Wstrict-prototypes  -I. -IInclude -I./Include   -DPy_BUILD_CORE -o Python/dynload_shlib.o Python/dynload_shlib.c
gcc -c -fno-strict-aliasing -DNDEBUG -g -fwrapv -O3 -Wall -Wstrict-prototypes  -I. -IInclude -I./Include   -DPy_BUILD_CORE -o Python/thread.o Python/thread.c
gcc -c -fno-strict-aliasing -DNDEBUG -g -fwrapv -O3 -Wall -Wstrict-prototypes  -I. -IInclude -I./Include   -DPy_BUILD_CORE -o Modules/config.o Modules/config.c
gcc -c -fno-strict-aliasing -DNDEBUG -g -fwrapv -O3 -Wall -Wstrict-prototypes  -I. -IInclude -I./Include   -DPy_BUILD_CORE -DPYTHONPATH='":plat-cygwin"' \
		-DPREFIX='"/usr/local"' \
		-DEXEC_PREFIX='"/usr/local"' \
		-DVERSION='"3.1"' \
		-DVPATH='""' \
		-o Modules/getpath.o ./Modules/getpath.c
gcc -c -fno-strict-aliasing -DNDEBUG -g -fwrapv -O3 -Wall -Wstrict-prototypes  -I. -IInclude -I./Include   -DPy_BUILD_CORE -o Modules/main.o Modules/main.c
Modules/main.c:17:1: warning: "PATH_MAX" redefined
In file included from /usr/lib/gcc/i686-pc-cygwin/4.3.4/include-fixed/limits.h:122,
                 from /usr/lib/gcc/i686-pc-cygwin/4.3.4/include-fixed/syslimits.h:7,
                 from /usr/lib/gcc/i686-pc-cygwin/4.3.4/include-fixed/limits.h:11,
                 from Include/Python.h:11,
                 from Modules/main.c:3:
/usr/include/limits.h:329:1: warning: this is the location of the previous definition
Modules/main.c: In function ‘_wfopen’:
Modules/main.c:107: error: ‘PATH_MAX’ undeclared (first use in this function)
Modules/main.c:107: error: (Each undeclared identifier is reported only once
Modules/main.c:107: error: for each function it appears in.)
Modules/main.c:107: warning: unused variable ‘cpath’
Modules/main.c: In function ‘Py_Main’:
Modules/main.c:421: warning: implicit declaration of function ‘_setmode’
Modules/main.c:550: error: ‘PATH_MAX’ undeclared (first use in this function)
Modules/main.c:550: warning: unused variable ‘cfilename’
make: *** [Modules/main.o] Error 1
